�s���{���R�[�h���͎s�撬���R�[�h,NO,�s���{����,�s�撬����,�C�x���g��,�C�x���g��_�J�i,�C�x���g��_�p��,�J�n��,�I����,�J�n����,�I������,�J�n�������L����,����,�����i��{�j,�����i�ڍׁj,�A���於��,�A����d�b�ԍ�,�A��������ԍ�,��Î�,�ꏊ����,�Z��,����,�A�N�Z�X���@,���ԏ���,���,�Q���\���I����,�Q���\���I������,�Q���\�����@,URL,���l,���E_10�i_X,���E_10�i_Y
32018,20,��茧,�����s,�Ȃ�����䏊�΂܂�,�c�i�M�I���Z���S�V���R�}�c��,,7��31��,7��31��,,,,,,,�Ȃ�����ό�����,019-689�|2109,,,�q�E�䏊��,��茧�����s�q��m��,,,,,,,,,,141.019775,39.67639
32018,30,��茧,�����s,�S���{��񂱂��ΑI�茠,�[���j�z�������R�\�o�Z���V���P��,,2022�N�J�Ò��~,,,,,,,,�����s�o�ϊ���,019-651�|4111,,,�z�e�����,��茧�����s�q���m��37-1,,,,,,,,,,141.022652,39.676215
32018,5,��茧,�����s,���Q��,�n�_�J�}�C��,,2022�N�J�Ò��~,,,,,,,,�ό��������v���U,019-604-3305,,,�󑐊ϐ���,��茧�����s�[�琣��9,,,,,,,,,,141.131272,39.706794
32018,10,��茧,�����s,�����|�p��,�����I�J�Q�C�W���c�T�C,,4��28��,4��28��,,,,,,,�����s�������ۉ�,019-626-7524,,,�����s�������z�[���A��������A���������فA�}���I�X�W�]��,,,,,,,,,,,141.1336028,39.70124312
32018,12,��茧,�����s,YOSAKOI����,���T�R�C�T���T,,2022�N�J�Ò��~,,,,,,,,YOSAKOI���񂳎��s�ψ���,019-623-7131,,,�����w�O��̍L��A��ʏ��X�X�ق�,,,,,,,,,,,141.136954,39.70176923
32018,15,��茧,�����s,���������Ղ�,�����I�J�T�c�L�}�c��,,6��10��,6��12��,,,,,,,���������Ղ���s�ψ���,090-7325-1750,,,��c������,��茧�����s��c4-1-1,,,,,,,,,,141.138079,39.720411
32018,2,��茧,�����s,���Q��,�n�_�J�}�C��,,2022�N�J�Ò��~,,,,,,,,�ό��������v���U,019-604-3305,,,�i�ˉ@�@�𔃒n��,��茧�����s�ޖؒ�4-10,,,,,,,,,,141.13873,39.706946
32018,18,��茧,�����s,�𔃒n��������,�T�P�J�C�W�]�E�\�����C�^�C�T�C,,2022�N�J�Ò��~,,,,,,,,�ޖؒ����X�X�����g��,019-623-3845,,,�i�ˉ@�A�ޖؒ����X�X�R�~���j�e�B���H,��茧�����s�ޖؒ�4-10,,,,,,,,,,141.13873,39.706946
32018,29,��茧,�����s,���肨�����ƍH�|�W,�����I�J�A�W�g�R�E�Q�C�e��,,9��22��,9��26��,,,,,,,�����s���̂Â��萄�i��,019-651�|4111,,,�p���N�A�x�j���[�쓿,��茧�����s�؉�1-10-1,,,,,,,,,,141.146956,39.700773
32018,14,��茧,�����s,�吷���_����,�_�C�����I�J�V���R�E�T�C,,2022�N�J�Ò��~,,,,,,,,�吷���_���Վ��s�ψ���,090-3360-1540,,,���m�������͐�~�`�����s��ʋ������,,,,,,,,,,,141.1477352,39.70287098
32018,19,��茧,�����s,��46�񐷉��E�k���S���{�[�g�쉺����,�_�C�����W���E���b�J�C,,7��24��,7��24��,,,,,,,�����E�k���S���{�[�g�쉺������s�ψ������,019-613-2542,,,�l�\�l�c�_���`��勴�͐�~,,,,,,,,,,,141.1486565,39.75311906
32018,21,��茧,�����s,�������񂳗x��,�����I�J�T���T�I�h��,,8��1��,8��4��,,,,,,,�������񂳗x����s�ψ���,019-624�|5880,,,������,��茧�����s������,,,,,,,,,,141.148481,39.704419
32018,25,��茧,�����s,�����M��������,�����I�J�t�l�b�R�i�K�V,,8��20��,8��20��,,,,,,,�ό��������v���U,019-604-3305,,,�������㗬,��茧�����s��k1-2,,,,,,,,,,141.149251,39.691823
32018,6,��茧,�����s,���Q��,�n�_�J�}�C��,,2022�N�J�Ò��~,,,,,,,,�ό��������v���U,019-604-3305,,,���R�_��,��茧�����s����1-42,,,,,,,,,,141.151893,39.701464
32018,17,��茧,�����s,���킵�܁E���񂹂���,�A���V�}�E�R���Z�C�}�c��,,7��23��,7��23��,,,,,,,������������_��,019-661-6211,,,������Ռ����Ő��L��,��茧�����s���ۂP�|37,,,,,,,,,,141.1520154,39.70011764
32018,1,��茧,�����s,���Q��,�n�_�J�}�C��,,2022�N�J�Ò��~,,,,,,,,�ό��������v���U,019-604-3305,,,�s�މ@�@���󑠓�,��茧�����s��k2-22-48,,,,,,,,,,141.15276,39.689086
32018,3,��茧,�����s,���Q��,�n�_�J�}�C��,,2022�N�J�Ò��~,,,,,,,,�ό��������v���U,019-604-3305,,,����,��茧�����s�k�R1-13-25,,,,,,,,,,141.152936,39.715144
32018,22,��茧,�����s,�������[�Ղ�,�����I�J�^�i�o�^�}�c��,,8��1��,8��7��,,,,,,,�撬���X�X�����g��,019-625�|1515,,,�z�b�g���C���撬�A�[�P�[�h,��茧�����s�撬,,,,,,,,,,141.155083,39.698982
32018,9,��茧,�����s,�������Ƌ���̐��Ղ�,�����I�J�}�`���L���E���L�m�q�i�}�c��,,2022�N�J�Ò��~,,,,,,,,�����܂����ݏm������,019-622-8989,,,�뉮���A�厜�����E�G,,,,,,,,,,,141.1572559,39.6918004
32018,31,��茧,�����s,�������m��,�����I�J�u���V�Q�L,,12��3��,12��4��,,,,,,,��������,019-622�|2258,,,��������,��茧�����s������3-1,,,,,,,,,,141.158177,39.696354
32018,26,��茧,�����s,�S�����Z���Z�̑��i�Z�̍b�q���j,�[���R�N�R�E�R�E�Z�C�^���J�^�C�J�C�i�^���J�R�E�V�G���j,,7��27��,7��29��,,,,,,,�����s�ό���,019-651-4111,,,��������A�P�_�z�[��,,,,,,,,,,,141.1584023,39.69633253
32018,27,��茧,�����s,�����H�܂�R��,�����I�J�A�L�}�c���_�V,,9��14��,9��16��,,,,,,,�����ό��R���x���V��������,019�|621�|8800,,,�����s����~,,,,,,,,,,,141.1638992,39.69525075
32018,4,��茧,�����s,���Q��,�n�_�J�}�C��,,2022�N�J�Ò��~,,,,,,,,�ό��������v���U,019-604-3305,,,���������{,��茧�����s������13-1,,,,,,,,,,141.164034,39.695398
32018,16,��茧,�����s,�`���O�`���O�n�R,�`���O�`���O�E�}�R,,6��11��,6��11��,,,,,,,�����s�ό���,019-651-4111,,,�i���s�j�S�z���O�_�Ё`�i�����s�j���������{,,,,,,,,,,,141.164215,39.69545589
32018,23,��茧,�����s,�ʎR�Ă܂�,�^�}���}�i�c�}�c��,,8��6��,8��6��,,,,,,,�����s�Y�ƐU����,019-683-3852,,,�a���^������,��茧�����s��莚���1-1,,,,,,,,,,141.16649,39.851022
32018,13,��茧,�����s,��؍�,�^�N�{�N�T�C,,6��4��,6��4��,,,,,,,�ΐ��؋L�O��,019-683-2315,,,�a��������فi�P�_�z�[���j,��茧�����s�a�����ߒ�,,,,,,,,,,141.169557,39.849303
32018,24,��茧,�����s,�����ԉ΂̍ՓT,�����I�J�n�i�r�m�T�C�e��,,10��10��,10��10��,,,,,,,�����ԉ΂̍ՓT���s�ψ���,019-638�|3399,,,�s��勴�����k���͔�,��茧�����s������V�c,,,,,,,,,,141.17046,39.659177
32018,11,��茧,�����s,�P�_�R��܊J��,�q���J�~�T�����}�r���L,,5��15��,5��15��,,,,,,,�����s�Y�ƐU����,019-683-3852,,,�P�_�R��{���o�R��,��茧�����s�ʎR�n�ꎚ�O�c,,,,,,,,,,141.230641,39.854169
32018,28,��茧,�����s,�⓴�΂܂�,�K���h�E�R�}�c��,,2022�N�J�Ò��~,,,,,,,,�����s�Y�ƐU����,019-683-3852,,,�⓴�ΉƑ����s�� ���܂�L��,��茧�����s���쎚�T��33-4,,,,,,,,,,141.345072,39.829013
